{"text_format":"1","workbook":"xlsx","n_sheets":7,"sheets":["Introduction","Instructions","School or Setting audit","Progress tracker","Action plan","Audit Tracker","Workings"],"not_rendered":{"charts":20,"images":0,"macros":1,"external_links":2,"defined_names":143,"comments":0,"pivot_tables":0},"unopened":[],"bounds":{"document_bytes":16777216,"sheet_cells":100000,"rows_first":2000,"rows_last":500,"rows_between":2000,"halvings":0,"cell_chars":16384,"cell_head_chars":4096},"cells_cut":0,"cells_raw":0,"read":"whole","date_system":"1900"}

{"sheet":"Introduction","index":0,"n_rows":10,"n_cols":1,"rows_kept":10,"cut":false,"hidden":false,"merged":[]}
[]
["Audit and Action Planning Tool "]
[]
["Name: "]
["Job title: "]
["Email:"]
["School or Setting name: "]
[]
["Introduction"]
["This audit and action planning tool is for schools and settings doing whole school work including targeted work with individual children and young people and supports schools and settings to develop effective strategies to prevent and respond to key issues.   \n\nOnce you have completed your baseline audit you will be able to clearly see where your school or setting is effective and what you might need to work on. You can then develop an action plan to support you to take the work forward. We recommend repeating this termly.  \n\nIf you have any questions about this tool, please contact inclusionandsend@norfolk.gov.uk.   "]

{"sheet":"Instructions","index":1,"n_rows":11,"n_cols":1,"rows_kept":11,"cut":false,"hidden":false,"merged":[]}
["Instructions:"]
["STEP 1 - First audit"]
["Select the ‘School or Setting audit' sheet. You will see a number of indicators. In column B, select if you have ‘Fully met, ‘Partially met' or ‘Not yet met' the indicator. Once you have completed this, use column C to select whether to add each indicator to your action plan as a goal for your school or setting to work towards. If you select 'Yes' from the drop-down list in this column, the entry will automatically be added to the 'Action Plan' sheet."]
["STEP 2 - Action plan"]
["Select the ‘Action Plan’ sheet. You will see that the indicators you have chosen to work on have appeared automatically in the pink boxes. You will also notice that some suggested actions have been added underneath the indicator which will help you reach your goal. You can also add other actions and outline who is going to implement the action, and what the timeframe is for making the change. Share this with colleagues across the school and implement your action plan, indicating whether you have completed the actions in column D. "]
["STEP 3 – Second audit"]
["Once your action plan is complete (i.e. you have selected an answer in column D for each action), go back to the ‘School or Setting audit’ sheet and assess the indicators again using column D, ‘Second audit’ and select if you have ‘Fully met, ‘Partially met' or ‘Not yet met' each indicator. \nHow often you repeat the action plan is dependent on your current needs, we would recommend completing it on a termly basis to support school improvement."]
["STEP 4 – Progress tracker"]
["Select the ‘Progress Tracker’ sheet to see a visual representation of your audit and a summary of the progress made on your action plan. You will see how your final audit compares against your first audit. You can also access this at any time during the process to check on progress. "]
["STEP 5 – Futher support"]
["If you would like further support then you can share your audit tool with us. Please contact us on inclusionandsend@norfolk.gov.uk."]

{"sheet":"School or Setting audit","index":2,"n_rows":35,"n_cols":5,"rows_kept":35,"cut":false,"hidden":false,"merged":[[25,0,25,3],[29,0,29,3],[31,0,31,3],[0,0,0,3],[1,0,1,3],[22,0,22,3],[14,0,14,3],[18,0,18,3],[3,0,3,3],[6,0,6,3],[11,0,11,3]]}
["School audit"]
[" - First, identify a group of key staff who will lead on this work\n   TIP: Completing this audit together will make your assessment more accurate\n - There are 16 indicators in 4 areas to assess your approach to addressing homophobic, biphobic & transphobic bullying\n - Hover over each indicator to display guidance\n - Add indicators to the Action plan by choosing 'Yes' in column B"]
["School or Setting name:","First Audit","Add to Action plan","Second Audit"]
["1) Ethos and Environment\n"]
["1.1. Does the school  recognise and celebrate the importance of bilingualism? Is there evidence of first languages being celebrated throughout the school and being used to support learning?","Choose…","No","Choose…",{"$f":"C5&COUNTIF($C$5:C5,C5)","v":"No1"}]
["1.2  Does the school demonstrate how assemblies and other events are used as an opportunity to celebrate diversity and educate CYP about the world we live in?","Choose…","No","Choose…",{"$f":"C6&COUNTIF($C$5:C6,C6)","v":"No2"}]
["2) Leadership and Governance\n"]
["2.1 Is there a member of SLT who has specific responsibility for EAL? This may be a monitoring role with day-to-day functions delegated to others.","Choose…","No","Choose…",{"$f":"C8&COUNTIF($C$5:C8,C8)","v":"No3"}]
["2.2 Do you deploy EAL funding strategically to support the learning of CYP with EAL and to fund services such as Language Line/INTRAN?","Choose…","No","Choose…",{"$f":"C9&COUNTIF($C$5:C9,C9)","v":"No4"}]
["2.3 Does the school's development plan have clear objectives and strategies for ensuring the attainment of minority ethnic, newly arrived and more advanced CYP with EAL?","Choose…","No","Choose…",{"$f":"C10&COUNTIF($C$5:C10,C10)","v":"No5"}]
["2.4 Are appropriate access arrangements for examinations are made  for CYP with EAL?","Choose…","No","Choose…",{"$f":"C11&COUNTIF($C$5:C11,C11)","v":"No6"}]
["3) Policy Development"]
["3.1 Does the school have an EAL policy which is accessible to all staff and parents?","Choose…","No","Choose…",{"$f":"C13&COUNTIF($C$5:C13,C13)","v":"No7"}]
["3.2 Does the school  have rigorous anti-bullying and anti-racism policies in place and are staff aware of how to deal with racist incidents?","Choose…","No","Choose…",{"$f":"C14&COUNTIF($C$5:C14,C14)","v":"No8"}]
["4) Children and Young People's Voice"]
["4.1 Is the School Council fully representative of all CYP?","Choose…","No","Choose…",{"$f":"C16&COUNTIF($C$5:C16,C16)","v":"No9"}]
["4.2 Is CYP voice present throughout support plans, EHAPs, PEPs for UASC etc?","Choose…","No","Choose…",{"$f":"C17&COUNTIF($C$5:C17,C17)","v":"No10"}]
["4.3 Does the school organise an effective buddy scheme (e.g. Young Interpreters Scheme)?","Choose…","No","Choose…",{"$f":"C18&COUNTIF($C$5:C18,C18)","v":"No11"}]
["5) Support and Signposting for Children and Young People"]
["5.1 Does the school provide support to CYP during admission, induction and transition to our school?","Choose…","No","Choose…",{"$f":"C20&COUNTIF($C$5:C20,C20)","v":"No12"}]
{"$rows_left_out":16}
{"sheet":"Progress tracker","index":3,"n_rows":2,"n_cols":1,"rows_kept":2,"cut":false,"hidden":false,"merged":[[1,0,1,17],[0,0,0,17]]}
["Progress tracker"]
[" - This page is a visual representation of your School or Setting audit\n - The charts show what proportion of your answers were 'Fully', 'Partially' or 'Not yet' met, overall and across the nine areas of the audit\n - Complete the audit routinely to show progress over time\n   TIP: Share your tracker with staff and governors to encourage buy-in across the school or setting community "]

{"sheet":"Action plan","index":4,"n_rows":125,"n_cols":5,"rows_kept":125,"cut":false,"hidden":false,"merged":[[0,0,0,3],[1,0,1,3]]}
["Action plan"]
[" - Indicators you selected in the School or Setting audit will appear here\n - Decide what actions need to take place to make progress in this area\n   TIP: Break things down into manageable tasks; there are two extra rows if you need them\n - Include a due date, who the task is delegated to and update when it is completed"]
["Indicator:","Due by:","Delegated to:","Completed?"]
["1.1. Does the school  recognise and celebrate the importance of bilingualism? Is there evidence of first languages being celebrated throughout the school and being used to support learning?",null,null,null,{"$f":"IF('School or Setting audit'!$C$5=\"Yes\",\"Show\",\"Hide\")","v":"Hide"}]
["Displays and resources in your school reflect the diversity of CYP and range of languages in the school.",null,null,"Choose…",{"$f":"IF('School or Setting audit'!$C$5=\"Yes\",\"Show\",\"Hide\")","v":"Hide"}]
["Books, reading schemes and class texts contain a diverse range of authors and characters.  (See WSA guide - Booklists)",null,null,"Choose…",{"$f":"IF('School or Setting audit'!$C$5=\"Yes\",\"Show\",\"Hide\")","v":"Hide"}]
["CYP's first languages are used in class to teach vocabulary and support written work.",null,null,"Choose…",{"$f":"IF('School or Setting audit'!$C$5=\"Yes\",\"Show\",\"Hide\")","v":"Hide"}]
[null,null,null,"Choose…",{"$f":"IF('School or Setting audit'!$C$5=\"Yes\",\"Show\",\"Hide\")","v":"Hide"}]
[null,null,null,"Choose…",{"$f":"IF('School or Setting audit'!$C$5=\"Yes\",\"Show\",\"Hide\")","v":"Hide"}]
["1.2  Does the school demonstrate how assemblies and other events are used as an opportunity to celebrate diversity and educate CYP about the world we live in?",null,null,null,{"$f":"IF('School or Setting audit'!$C$6=\"Yes\",\"Show\",\"Hide\")","v":"Hide"}]
["Assemblies offer CYP the opportunity to learn about migration and about inclusion and other cultures and recognise relevant cultural events. (e.g., Eid, Diwali, Hannukah)",null,null,"Choose…",{"$f":"IF('School or Setting audit'!$C$6=\"Yes\",\"Show\",\"Hide\")","v":"Hide"}]
["CYP  are given opportunities to take part in special events such as the Day of Welcome (June), Refugee Week (June), Mother Language Day (Feb) GRT month (June), Roma day (April), European Languages Day (Sept), Black History Month (October).",null,null,"Choose…",{"$f":"IF('School or Setting audit'!$C$6=\"Yes\",\"Show\",\"Hide\")","v":"Hide"}]
["The school identifies events which are relevant to the school community and encourages families with EAL and from EDC (Ethnically Diverse Communities) to join in.",null,null,"Choose…",{"$f":"IF('School or Setting audit'!$C$6=\"Yes\",\"Show\",\"Hide\")","v":"Hide"}]
[null,null,null,"Choose…",{"$f":"IF('School or Setting audit'!$C$6=\"Yes\",\"Show\",\"Hide\")","v":"Hide"}]
[null,null,null,"Choose…",{"$f":"IF('School or Setting audit'!$C$6=\"Yes\",\"Show\",\"Hide\")","v":"Hide"}]
["2.1 Is there a member of SLT who has specific responsibility for EAL? This may be a monitoring role with day-to-day functions delegated to others.",null,null,null,{"$f":"IF('School or Setting audit'!$C$8=\"Yes\",\"Show\",\"Hide\")","v":"Hide"}]
["A member of SLT is appointed as your EAL Lead. (A sample EAL Lead role description is available in the EAL thematic toolkit)",null,null,"Choose…",{"$f":"IF('School or Setting audit'!$C$8=\"Yes\",\"Show\",\"Hide\")","v":"Hide"}]
["Governors are aware of EAL policies, data and development within the school through regular reporting.",null,null,"Choose…",{"$f":"IF('School or Setting audit'!$C$8=\"Yes\",\"Show\",\"Hide\")","v":"Hide"}]
[null,null,null,"Choose…",{"$f":"IF('School or Setting audit'!$C$8=\"Yes\",\"Show\",\"Hide\")","v":"Hide"}]
[null,null,null,"Choose…",{"$f":"IF('School or Setting audit'!$C$8=\"Yes\",\"Show\",\"Hide\")","v":"Hide"}]
{"$rows_left_out":106}
{"sheet":"Audit Tracker","index":5,"n_rows":29,"n_cols":1,"rows_kept":29,"cut":false,"hidden":true,"merged":[[0,0,0,17],[1,0,1,17],[2,0,2,17],[28,0,28,17]]}
["Audit tracker"]
[" - This page is a visual representation of your School auditresponses, separated by first and second audits\n - The charts show what proportion of your answers were 'Fully', 'Partially' or 'Not yet' met, overall and across the four areas of the audit\n   TIP: If you want to focus on one term only. Use the +/- button to the bottom left of each chart to open and close them"]
["Progress tracker - First Audit"]
[]
[]
[]
[]
[]
[]
[]
[]
[]
[]
[]
[]
[]
[]
[]
[]
[]
{"$rows_left_out":10}
{"sheet":"Workings","index":6,"n_rows":52,"n_cols":75,"rows_kept":52,"cut":false,"hidden":true,"merged":[[19,48,19,74],[19,9,19,20],[0,9,0,10],[0,11,0,12],[0,13,0,14],[19,21,19,47]]}
["Local Authority",null,"Rating",null,"Yes/No",null,"Other Rating",null,null,"Term 1",null,"Term 2",null,null,null,null,null,null,null,null,"Action Time Frames",null,"Indicators"]
[null,null,"Choose…",null,"Choose…",null,null,null,null,"Total","Total %","Total","Total %",null,null,null,null,null,null,null,"Choose timeframe…"]
["Birmingham City Council",null,"Fully met",null,"Yes",null,"Yes, and have had an impact",null,null,{"$f":"$J$1","v":"Term 1"},{"$f":"$J$1","v":"Term 1"},{"$f":"$L$1","v":"Term 2"},{"$f":"$L$1","v":"Term 2"},null,null,"Rating Value",null,null,null,null,"Long Term",null,"1. The school anti-bullying policy specifically references homophobic, biphobic and transphobic bullying."]
["Bristol",null,"Partially met",null,"No",null,"Yes, but have had little impact",null,"Fully met",{"$f":"COUNTIFS('School or Setting audit'!$B$5:$B$25,$I4)","v":0},{"$f":"IFERROR($J4/$J$7,\"\")","v":""},{"$f":"COUNTIFS('School or Setting audit'!$D$5:$D$25,$I4)","v":0},{"$f":"IFERROR($L4/$L$7,\"\")","v":""},null,null,2,null,null,null,null,"Medium Term",null,"2. The policy references the Equality Act 2010 and shows our commitment to preventing and responding effectively to the bullying of protected* and vulnerable groups."]
["Derby",null,"Not yet met",null,null,null,"None",null,"Partially met",{"$f":"COUNTIFS('School or Setting audit'!$B$5:$B$25,$I5)","v":0},{"$f":"IFERROR($J5/$J$7,\"\")","v":""},{"$f":"COUNTIFS('School or Setting audit'!$D$5:$D$25,$I5)","v":0},{"$f":"IFERROR($L5/$L$7,\"\")","v":""},null,null,1,null,null,null,null,"Short Term",null,"3. The Head and Senior Management Team demonstrate a clear commitment to preventing and tackling homophobia, biphobia and transphobia."]
["Herefordshire",null,null,null,"Yes/No without Choose",null,null,null,"Not yet met",{"$f":"COUNTIFS('School or Setting audit'!$B$5:$B$25,$I6)","v":0},{"$f":"IFERROR($J6/$J$7,\"\")","v":""},{"$f":"COUNTIFS('School or Setting audit'!$D$5:$D$25,$I6)","v":0},{"$f":"IFERROR($L6/$L$7,\"\")","v":""},null,null,0,null,null,null,null,null,null,"4. Bullying is recorded by type, including homophobic, biphobic, transphobic and sexist bullying, and this data is regularly analysed, reported to governors and used to inform whole school developments."]
["Leicestershire",null,null,null,null,null,null,null,"Total",{"$f":"SUM(J4:J6)","v":0},0,0,0,null,null,null,null,null,null,null,null,null,"5. External organisations are or have been used to support and complement work to prevent and respond to HBT bullying. "]
["Lincolnshire",null,null,null,"Yes",null,null,null,null,null,null,null,null,null,null,null,null,null,null,null,null,null,"6. The SRE curriculum and teaching is LGBT-inclusive and staff are confident to address same-sex relationships, gender stereotyping and gender identity."]
["Luton",null,null,null,"No",null,null,null,null,null,null,null,null,null,null,null,null,null,null,null,null,null,"7. Lesbian, Gay, Bisexual and Trans (LGBT) people are visible in the curriculum, including in core subjects."]
["Norfolk",null,null,null,null,null,null,null,null,null,null,null,null,null,null,null,null,null,null,null,null,null,"8. Diverse families and LGBT role models are visible throughout the school including on displays, electronic screens and in the library."]
["Gloucestershire",null,null,null,"Yes without Choose",null,null,null,null,null,null,null,null,null,null,null,null,null,null,null,null,null,"9. LGBT equality is celebrated and events are used to raise awareness of the impact of homophobia, biphobia and transphobia."]
["South Gloucestershire",null,null,null,"No",null,null,null,null,null,null,null,null,null,null,null,null,null,null,null,null,null,"10. School staff and pupils have a shared understanding of what bullying is."]
["Stoke-on-Trent",null,null,null,"Yes",null,null,null,null,null,null,null,null,null,null,null,null,null,null,null,null,null,"11. All school staff, including governors, receive appropriate training and support to address HBT bullying."]
["Worcestershire",null,null,null,null,null,null,null,null,null,null,null,null,null,null,null,null,null,null,null,null,null,"12. Skilled staff support students who want to discuss their sexual orientation and/or gender identity."]
[null,null,null,null,null,null,null,null,null,null,null,null,null,null,null,null,null,null,null,null,null,null,"13. Students are aware of how to report all incidents of homophobic, biphobic and transphobic bullying."]
[null,null,null,null,"Yes/No/Partially",null,null,null,null,null,null,null,null,null,null,null,null,null,null,null,null,null,"14. Students are consulted about how the school's anti-bullying policy is implemented, including HBT bullying."]
[null,null,null,null,"Choose…",null,null,null,null,null,null,null,null,null,null,null,null,null,null,null,null,null,"15. Students are supported to coordinate activities which promote a more LGBT-inclusive school."]
[null,null,null,null,"Yes",null,null,null,null,null,null,null,null,null,null,null,null,null,null,null,null,null,"16. Parents and carers receive information about the requirements of the Equality Act 2010 and how the school tackles HBT bullying."]
[null,null,null,null,"No"]
[null,null,null,null,"Partially",null,null,null,null,null,null,null,null,null,null,null,null,null,null,null,null,"Second Audit",null,null,null,null,null,null,null,null,null,null,null,null,null,null,null,null,null,null,null,null,null,null,null,null,null,null,"First Audit"]
{"$rows_left_out":32}